The little typo was corrected

12 jobs for typo in 18 minutes (queued for 10 seconds)
Name Stage Failure
failed
test_macosx_34 Test There is an unknown failure, please try again

----------------------------------------------------------------------
Ran 38 tests in 166.450s

FAILED (failures=1)
(11:12:02)
Error: Command Failed "/Users/buildbot/work/gitlab-ci/f6f95b82/0/bob/bob.bio.base/build-prefix/bin/coverage run --source=bob.bio.base /Users/buildbot/work/gitlab-ci/f6f95b82/0/bob/bob.bio.base/build-prefix/bin/nosetests -sv bob.bio.base"
Running after script...
$ ./_ci/after_test.sh
ERROR: Build failed: exit status 1
failed
test_linux_34 Test There is an unknown failure, please try again

----------------------------------------------------------------------
Ran 38 tests in 127.726s

FAILED (failures=1)
(11:03:18)
Error: Command Failed "/home/gitlab-runner/builds/0d638152/1/bob/bob.bio.base/build-prefix/bin/coverage run --source=bob.bio.base /home/gitlab-runner/builds/0d638152/1/bob/bob.bio.base/build-prefix/bin/nosetests -sv bob.bio.base"
Running after script...
$ ./_ci/after_test.sh
ERROR: Build failed: exit status 1
failed
test_linux_27 Test There is an unknown failure, please try again

----------------------------------------------------------------------
Ran 38 tests in 114.573s

FAILED (failures=1)
(11:03:04)
Error: Command Failed "/home/gitlab-runner/builds/0d638152/2/bob/bob.bio.base/build-prefix/bin/coverage run --source=bob.bio.base /home/gitlab-runner/builds/0d638152/2/bob/bob.bio.base/build-prefix/bin/nosetests -sv bob.bio.base"
Running after script...
$ ./_ci/after_test.sh
ERROR: Build failed: exit status 1
failed
test_linux_35 Test There is an unknown failure, please try again

----------------------------------------------------------------------
Ran 38 tests in 129.381s

FAILED (failures=1)
(11:03:17)
Error: Command Failed "/home/gitlab-runner/builds/0d638152/0/bob/bob.bio.base/build-prefix/bin/coverage run --source=bob.bio.base /home/gitlab-runner/builds/0d638152/0/bob/bob.bio.base/build-prefix/bin/nosetests -sv bob.bio.base"
Running after script...
$ ./_ci/after_test.sh
ERROR: Build failed: exit status 1
failed
test_macosx_27 Test There is an unknown failure, please try again

----------------------------------------------------------------------
Ran 38 tests in 149.602s

FAILED (failures=1)
(11:07:43)
Error: Command Failed "/Users/buildbot/work/gitlab-ci/f6f95b82/2/bob/bob.bio.base/build-prefix/bin/coverage run --source=bob.bio.base /Users/buildbot/work/gitlab-ci/f6f95b82/2/bob/bob.bio.base/build-prefix/bin/nosetests -sv bob.bio.base"
Running after script...
$ ./_ci/after_test.sh
ERROR: Build failed: exit status 1
failed
test_macosx_35 Test There is an unknown failure, please try again

----------------------------------------------------------------------
Ran 38 tests in 162.205s

FAILED (failures=1)
(11:12:47)
Error: Command Failed "/Users/buildbot/work/gitlab-ci/f6f95b82/1/bob/bob.bio.base/build-prefix/bin/coverage run --source=bob.bio.base /Users/buildbot/work/gitlab-ci/f6f95b82/1/bob/bob.bio.base/build-prefix/bin/nosetests -sv bob.bio.base"
Running after script...
$ ./_ci/after_test.sh
ERROR: Build failed: exit status 1