drop bob.io.image dependency

5 jobs for allow-no-dask in 14 minutes and 49 seconds (queued for 1 second)
Name Stage Failure
failed
build_macos_intel_38 Build
Tests failed for bob.bio.base-6.0.1b0-py38ha76d337_112.conda - moving package to /Users/gitlab/builds/6eE8C-FW/0/bob/bob.bio.base/miniconda/conda-bld/broken
TESTS FAILED: bob.bio.base-6.0.1b0-py38ha76d337_112.conda
Uploading artifacts for failed job
Uploading artifacts...
Runtime platform
arch=amd64 os=darwin pid=16502 revision=c6bb62f6 version=14.10.0
WARNING: coverage.xml: no matching files
ERROR: No files to upload
Cleaning up project directory and file based variables
ERROR: Job failed: exit status 1

failed
build_macos_intel_39 Build
Tests failed for bob.bio.base-6.0.1b0-py39ha76d337_108.conda - moving package to /Users/gitlab/builds/6eE8C-FW/1/bob/bob.bio.base/miniconda/conda-bld/broken
TESTS FAILED: bob.bio.base-6.0.1b0-py39ha76d337_108.conda
Uploading artifacts for failed job
Uploading artifacts...
Runtime platform
arch=amd64 os=darwin pid=15909 revision=c6bb62f6 version=14.10.0
WARNING: coverage.xml: no matching files
ERROR: No files to upload
Cleaning up project directory and file based variables
ERROR: Job failed: exit status 1

failed
build_linux_38 Build
FAILED (errors=17, failures=2)
Tests failed for bob.bio.base-6.0.1b0-py38hc16d597_124.conda - moving package to /scratch/builds/bob/bob.bio.base/miniconda/conda-bld/broken
TESTS FAILED: bob.bio.base-6.0.1b0-py38hc16d597_124.conda
Uploading artifacts for failed job
Uploading artifacts...
WARNING: coverage.xml: no matching files
ERROR: No files to upload
Cleaning up project directory and file based variables
ERROR: Job failed: exit code 1

failed
build_linux_39 Build
FAILED (errors=17, failures=2)
Tests failed for bob.bio.base-6.0.1b0-py39hc16d597_120.conda - moving package to /scratch/builds/bob/bob.bio.base/miniconda/conda-bld/broken
TESTS FAILED: bob.bio.base-6.0.1b0-py39hc16d597_120.conda
Uploading artifacts for failed job
Uploading artifacts...
WARNING: coverage.xml: no matching files
ERROR: No files to upload
Cleaning up project directory and file based variables
ERROR: Job failed: exit code 1

failed
build_macos_arm_39 Build
Tests failed for bob.bio.base-6.0.1b0-py39h38106ff_119.conda - moving package to /Users/gitlab/builds/sAZPGTqW/0/bob/bob.bio.base/miniconda/conda-bld/broken
TESTS FAILED: bob.bio.base-6.0.1b0-py39h38106ff_119.conda
Uploading artifacts for failed job
Uploading artifacts...
Runtime platform
arch=arm64 os=darwin pid=48714 revision=c6bb62f6 version=14.10.0
WARNING: coverage.xml: no matching files
ERROR: No files to upload
Cleaning up project directory and file based variables
ERROR: Job failed: exit status 1