Made API backward compatible

6 jobs for new-features in 23 minutes and 40 seconds (queued for 11 seconds)
Status Job ID Name Coverage
  Build
failed #13860
conda-linux
build_linux_27

00:01:45

failed #13861
conda-linux
build_linux_34

00:02:49

failed #13862
conda-linux
build_linux_35

00:03:54

failed #13863
conda-macosx
build_macosx_27

00:07:12

failed #13864
conda-macosx
build_macosx_34

00:02:59

failed #13865
conda-macosx
build_macosx_35

00:05:01

 
Name Stage Failure
failed
build_macosx_35 Build There is an unknown failure, please try again
  File "/Users/buildbot/work/gitlab-ci/f6f95b82/2/bob/bob.ap/eggs/bob.buildout-2.0.15-py3.5.egg/bob/buildout/extension.py", line 213, in develop
zc.buildout.easy_install.call_subprocess(args)
File "/Users/buildbot/work/gitlab-ci/f6f95b82/2/bob/bob.ap/eggs/zc.buildout-2.5.3-py3.5.egg/zc/buildout/easy_install.py", line 160, in call_subprocess
% repr(args)[1:-1])
Exception: Failed to run command:
'/Users/buildbot/work/gitlab-ci/f6f95b82/2/bob/bob.ap/env/bin/python', '/var/folders/8n/phc2t7ln52l2srkgv49ybfj00001fc/T/tmpt4frx31h', '-v', 'develop', '-mxN', '-d', '/Users/buildbot/work/gitlab-ci/f6f95b82/2/bob/bob.ap/develop-eggs/tmp_tzj3_n1build'
Running after script...
$ rm -rf ${CONDA_PREFIX}
ERROR: Build failed: exit status 1
failed
build_macosx_34 Build There is an unknown failure, please try again
  File "/Users/buildbot/work/gitlab-ci/f6f95b82/1/bob/bob.ap/eggs/bob.buildout-2.0.15-py3.4.egg/bob/buildout/extension.py", line 213, in develop
zc.buildout.easy_install.call_subprocess(args)
File "/Users/buildbot/work/gitlab-ci/f6f95b82/1/bob/bob.ap/eggs/zc.buildout-2.5.3-py3.4.egg/zc/buildout/easy_install.py", line 160, in call_subprocess
% repr(args)[1:-1])
Exception: Failed to run command:
'/Users/buildbot/work/gitlab-ci/f6f95b82/1/bob/bob.ap/env/bin/python', '/var/folders/8n/phc2t7ln52l2srkgv49ybfj00001fc/T/tmp6pe2vuj7', '-v', 'develop', '-mxN', '-d', '/Users/buildbot/work/gitlab-ci/f6f95b82/1/bob/bob.ap/develop-eggs/tmp2ae6944ebuild'
Running after script...
$ rm -rf ${CONDA_PREFIX}
ERROR: Build failed: exit status 1
failed
build_macosx_27 Build There is an unknown failure, please try again
  File "/Users/buildbot/work/gitlab-ci/f6f95b82/0/bob/bob.ap/eggs/bob.buildout-2.0.15-py2.7.egg/bob/buildout/extension.py", line 213, in develop
zc.buildout.easy_install.call_subprocess(args)
File "/Users/buildbot/work/gitlab-ci/f6f95b82/0/bob/bob.ap/eggs/zc.buildout-2.5.3-py2.7.egg/zc/buildout/easy_install.py", line 160, in call_subprocess
% repr(args)[1:-1])
Exception: Failed to run command:
'/Users/buildbot/work/gitlab-ci/f6f95b82/0/bob/bob.ap/env/bin/python', '/var/folders/8n/phc2t7ln52l2srkgv49ybfj00001fc/T/tmpmr1SUE', '-v', 'develop', '-mxN', '-d', '/Users/buildbot/work/gitlab-ci/f6f95b82/0/bob/bob.ap/develop-eggs/tmp8fHt3cbuild'
Running after script...
$ rm -rf ${CONDA_PREFIX}
ERROR: Build failed: exit status 1
failed
build_linux_35 Build There is an unknown failure, please try again
  File "/local/gitlab-runner/builds/6b02994f/2/bob/bob.ap/eggs/bob.buildout-2.0.15-py3.5.egg/bob/buildout/extension.py", line 213, in develop
zc.buildout.easy_install.call_subprocess(args)
File "/local/gitlab-runner/builds/6b02994f/2/bob/bob.ap/eggs/zc.buildout-2.5.3-py3.5.egg/zc/buildout/easy_install.py", line 160, in call_subprocess
% repr(args)[1:-1])
Exception: Failed to run command:
'/local/gitlab-runner/builds/6b02994f/2/bob/bob.ap/env/bin/python', '/tmp/tmpsm8byozc', '-v', 'develop', '-mxN', '-d', '/local/gitlab-runner/builds/6b02994f/2/bob/bob.ap/develop-eggs/tmpqg5kkd9xbuild'
Running after script...
$ rm -rf ${CONDA_PREFIX}
ERROR: Build failed: exit status 1
failed
build_linux_34 Build There is an unknown failure, please try again
  File "/local/gitlab-runner/builds/6b02994f/1/bob/bob.ap/eggs/bob.buildout-2.0.15-py3.4.egg/bob/buildout/extension.py", line 213, in develop
zc.buildout.easy_install.call_subprocess(args)
File "/local/gitlab-runner/builds/6b02994f/1/bob/bob.ap/eggs/zc.buildout-2.5.3-py3.4.egg/zc/buildout/easy_install.py", line 160, in call_subprocess
% repr(args)[1:-1])
Exception: Failed to run command:
'/local/gitlab-runner/builds/6b02994f/1/bob/bob.ap/env/bin/python', '/tmp/tmpkim3ursa', '-v', 'develop', '-mxN', '-d', '/local/gitlab-runner/builds/6b02994f/1/bob/bob.ap/develop-eggs/tmphym109tnbuild'
Running after script...
$ rm -rf ${CONDA_PREFIX}
ERROR: Build failed: exit status 1
failed
build_linux_27 Build There is an unknown failure, please try again
  File "/local/gitlab-runner/builds/6b02994f/0/bob/bob.ap/eggs/bob.buildout-2.0.15-py2.7.egg/bob/buildout/extension.py", line 213, in develop
zc.buildout.easy_install.call_subprocess(args)
File "/local/gitlab-runner/builds/6b02994f/0/bob/bob.ap/eggs/zc.buildout-2.5.3-py2.7.egg/zc/buildout/easy_install.py", line 160, in call_subprocess
% repr(args)[1:-1])
Exception: Failed to run command:
'/local/gitlab-runner/builds/6b02994f/0/bob/bob.ap/env/bin/python', '/tmp/tmpIWGXvl', '-v', 'develop', '-mxN', '-d', '/local/gitlab-runner/builds/6b02994f/0/bob/bob.ap/develop-eggs/tmpc_NCLDbuild'
Running after script...
$ rm -rf ${CONDA_PREFIX}
ERROR: Build failed: exit status 1