[widgets][plotterparameterseditor] Fix bool type default value handling

4 jobs for pyproject_toml in 12 minutes and 31 seconds (queued for 6 seconds)
Status Job ID Name Coverage
  Build
failed #229404
docker
build_linux_37

00:09:52

91.0%
failed #229405
docker
build_linux_38

00:09:18

91.0%
failed #229402
intel macos
build_macos_intel_37

00:12:31

91.0%
failed #229403
intel macos
build_macos_intel_38

00:12:23

91.0%
 
Name Stage Failure
failed
build_macos_intel_37 Build
Tests failed for beat.editor-2.0.4b0-py37h2817976_38.conda - moving package to /Users/gitlab/builds/nrU4yQP1/0/beat/beat.editor/miniconda/conda-bld/broken
TESTS FAILED: beat.editor-2.0.4b0-py37h2817976_38.conda
Uploading artifacts for failed job
Uploading artifacts...
Runtime platform
arch=amd64 os=darwin pid=84039 revision=54944146 version=13.10.0
WARNING: coverage.xml: no matching files
ERROR: No files to upload
Cleaning up file based variables
ERROR: Job failed: exit status 1
failed
build_macos_intel_38 Build
Tests failed for beat.editor-2.0.4b0-py38h2817976_0.conda - moving package to /Users/gitlab/builds/nrU4yQP1/1/beat/beat.editor/miniconda/conda-bld/broken
TESTS FAILED: beat.editor-2.0.4b0-py38h2817976_0.conda
Uploading artifacts for failed job
Uploading artifacts...
Runtime platform
arch=amd64 os=darwin pid=84012 revision=54944146 version=13.10.0
WARNING: coverage.xml: no matching files
ERROR: No files to upload
Cleaning up file based variables
ERROR: Job failed: exit status 1
failed
build_linux_37 Build
============ 1 failed, 1437 passed, 3 warnings in 425.99s (0:07:05) ============
Tests failed for beat.editor-2.0.4b0-py37h340fbc6_55.conda - moving package to /scratch/builds/beat/beat.editor/miniconda/conda-bld/broken
TESTS FAILED: beat.editor-2.0.4b0-py37h340fbc6_55.conda
Uploading artifacts for failed job
Uploading artifacts...
WARNING: coverage.xml: no matching files
ERROR: No files to upload
Cleaning up file based variables
ERROR: Job failed: exit code 1
failed
build_linux_38 Build
========== 1 failed, 1437 passed, 13035 warnings in 430.97s (0:07:10) ==========
Tests failed for beat.editor-2.0.4b0-py38h340fbc6_0.conda - moving package to /scratch/builds/beat/beat.editor/miniconda/conda-bld/broken
TESTS FAILED: beat.editor-2.0.4b0-py38h340fbc6_0.conda
Uploading artifacts for failed job
Uploading artifacts...
WARNING: coverage.xml: no matching files
ERROR: No files to upload
Cleaning up file based variables
ERROR: Job failed: exit code 1