[global] Pre-commit cleanup

4 jobs for pyproject_toml in 14 minutes and 47 seconds (queued for 1 second)
Status Job ID Name Coverage
  Build
failed #229385
docker
build_linux_37

00:10:00

91.0%
failed #229386
docker
build_linux_38

00:05:16

failed #229383
intel macos
build_macos_intel_37

00:14:42

91.0%
failed #229384
intel macos
build_macos_intel_38

00:09:46

 
Name Stage Failure
failed
build_macos_intel_37 Build
Tests failed for beat.editor-2.0.4b0-py37h2817976_38.conda - moving package to /Users/gitlab/builds/nrU4yQP1/0/beat/beat.editor/miniconda/conda-bld/broken
TESTS FAILED: beat.editor-2.0.4b0-py37h2817976_38.conda
Uploading artifacts for failed job
Uploading artifacts...
Runtime platform
arch=amd64 os=darwin pid=59226 revision=54944146 version=13.10.0
WARNING: coverage.xml: no matching files
ERROR: No files to upload
Cleaning up file based variables
ERROR: Job failed: exit status 1
failed
build_linux_37 Build
============ 1 failed, 1437 passed, 3 warnings in 431.46s (0:07:11) ============
Tests failed for beat.editor-2.0.4b0-py37h340fbc6_55.conda - moving package to /scratch/builds/beat/beat.editor/miniconda/conda-bld/broken
TESTS FAILED: beat.editor-2.0.4b0-py37h340fbc6_55.conda
Uploading artifacts for failed job
Uploading artifacts...
WARNING: coverage.xml: no matching files
ERROR: No files to upload
Cleaning up file based variables
ERROR: Job failed: exit code 1
failed
build_macos_intel_38 Build
Tests failed for beat.editor-2.0.4b0-py38h2817976_0.conda - moving package to /Users/gitlab/builds/nrU4yQP1/1/beat/beat.editor/miniconda/conda-bld/broken
TESTS FAILED: beat.editor-2.0.4b0-py38h2817976_0.conda
Uploading artifacts for failed job
Uploading artifacts...
Runtime platform
arch=amd64 os=darwin pid=56778 revision=54944146 version=13.10.0
WARNING: coverage.xml: no matching files
ERROR: No files to upload
Cleaning up file based variables
ERROR: Job failed: exit status 1
failed
build_linux_38 Build
/scratch/builds/beat/beat.editor/miniconda/conda-bld/beat.editor_1618409828895/test_tmp/run_test.sh: line 9:  2561 Aborted                 (core dumped) pytest --cov=beat.editor -vl -rf /scratch/builds/beat/beat.editor/conda/../
Tests failed for beat.editor-2.0.4b0-py38h340fbc6_0.conda - moving package to /scratch/builds/beat/beat.editor/miniconda/conda-bld/broken
TESTS FAILED: beat.editor-2.0.4b0-py38h340fbc6_0.conda
Uploading artifacts for failed job
Uploading artifacts...
WARNING: coverage.xml: no matching files
ERROR: No files to upload
Cleaning up file based variables
ERROR: Job failed: exit code 1