[widgets][experimenteditor] patch remote/docker url icons and queue resource models

4 jobs for 184_toolchain_editor in 5 minutes and 5 seconds (queued for 7 seconds)
Status Job ID Name Coverage
  Build
failed #182281
docker
build_linux_36

00:05:02

failed #182282
docker
build_linux_37

00:04:57

failed #182279
macosx
build_macosx_36

00:04:53

failed #182280
macosx
build_macosx_37

00:04:46

 
Name Stage Failure
failed
build_linux_36 Build
FAILED ../../../../beat/editor/test/test_toolchaineditor.py::TestToolchainEditor::test_load_and_dump[user/shell_exec/1]
FAILED ../../../../beat/editor/test/test_toolchaineditor.py::TestToolchainEditor::test_load_and_dump[user/single/1]
FAILED ../../../../beat/editor/test/test_toolchaineditor.py::TestToolchainEditor::test_load_and_dump[user/triangle/1]
FAILED ../../../../beat/editor/test/test_toolchaineditor.py::TestToolchainEditor::test_load_and_dump[user/two_loops/1]
=========== 138 failed, 1153 passed, 1 warning in 164.83s (0:02:44) ============
Tests failed for beat.editor-2.0.0b0-py36h1bb9003_24.conda - moving package to /scratch/builds/beat/beat.editor/miniconda/conda-bld/broken
WARNING:conda_build.build:Tests failed for beat.editor-2.0.0b0-py36h1bb9003_24.conda - moving package to /scratch/builds/beat/beat.editor/miniconda/conda-bld/broken
TESTS FAILED: beat.editor-2.0.0b0-py36h1bb9003_24.conda
ERROR: Job failed: exit code 1
failed
build_linux_37 Build
FAILED ../../../../beat/editor/test/test_toolchaineditor.py::TestToolchainEditor::test_load_and_dump[user/shell_exec/1]
FAILED ../../../../beat/editor/test/test_toolchaineditor.py::TestToolchainEditor::test_load_and_dump[user/single/1]
FAILED ../../../../beat/editor/test/test_toolchaineditor.py::TestToolchainEditor::test_load_and_dump[user/triangle/1]
FAILED ../../../../beat/editor/test/test_toolchaineditor.py::TestToolchainEditor::test_load_and_dump[user/two_loops/1]
=========== 138 failed, 1153 passed, 1 warning in 163.33s (0:02:43) ============
Tests failed for beat.editor-2.0.0b0-py37h1bb9003_24.conda - moving package to /scratch/builds/beat/beat.editor/miniconda/conda-bld/broken
WARNING:conda_build.build:Tests failed for beat.editor-2.0.0b0-py37h1bb9003_24.conda - moving package to /scratch/builds/beat/beat.editor/miniconda/conda-bld/broken
TESTS FAILED: beat.editor-2.0.0b0-py37h1bb9003_24.conda
ERROR: Job failed: exit code 1
failed
build_macosx_36 Build
FAILED ../../../../beat/editor/test/test_toolchaineditor.py::TestToolchainEditor::test_load_and_dump[user/shell_exec/1]
FAILED ../../../../beat/editor/test/test_toolchaineditor.py::TestToolchainEditor::test_load_and_dump[user/single/1]
FAILED ../../../../beat/editor/test/test_toolchaineditor.py::TestToolchainEditor::test_load_and_dump[user/triangle/1]
FAILED ../../../../beat/editor/test/test_toolchaineditor.py::TestToolchainEditor::test_load_and_dump[user/two_loops/1]
=========== 138 failed, 1153 passed, 1 warning in 123.96s (0:02:03) ============
Tests failed for beat.editor-2.0.0b0-py36h1bb9003_41.conda - moving package to /Users/gitlab/builds/b6d3167a/0/beat/beat.editor/miniconda/conda-bld/broken
WARNING:conda_build.build:Tests failed for beat.editor-2.0.0b0-py36h1bb9003_41.conda - moving package to /Users/gitlab/builds/b6d3167a/0/beat/beat.editor/miniconda/conda-bld/broken
TESTS FAILED: beat.editor-2.0.0b0-py36h1bb9003_41.conda
ERROR: Job failed: exit status 1
failed
build_macosx_37 Build
FAILED ../../../../beat/editor/test/test_toolchaineditor.py::TestToolchainEditor::test_load_and_dump[user/shell_exec/1]
FAILED ../../../../beat/editor/test/test_toolchaineditor.py::TestToolchainEditor::test_load_and_dump[user/single/1]
FAILED ../../../../beat/editor/test/test_toolchaineditor.py::TestToolchainEditor::test_load_and_dump[user/triangle/1]
FAILED ../../../../beat/editor/test/test_toolchaineditor.py::TestToolchainEditor::test_load_and_dump[user/two_loops/1]
=========== 138 failed, 1153 passed, 1 warning in 121.61s (0:02:01) ============
Tests failed for beat.editor-2.0.0b0-py37h1bb9003_38.conda - moving package to /Users/gitlab/builds/b6d3167a/1/beat/beat.editor/miniconda/conda-bld/broken
WARNING:conda_build.build:Tests failed for beat.editor-2.0.0b0-py37h1bb9003_38.conda - moving package to /Users/gitlab/builds/b6d3167a/1/beat/beat.editor/miniconda/conda-bld/broken
TESTS FAILED: beat.editor-2.0.0b0-py37h1bb9003_38.conda
ERROR: Job failed: exit status 1