[widgets][toolchaineditor] Make resistent to bad json

4 jobs for implement_dataset_resources in 4 minutes and 57 seconds (queued for 1 second)
Status Job ID Name Coverage
  Build
failed #181605
docker
build_linux_36

00:04:49

failed #181606
docker
build_linux_37

00:04:42

failed #181603
macosx
build_macosx_36

00:04:57

failed #181604
macosx
build_macosx_37

00:04:51

 
Name Stage Failure
failed
build_linux_36 Build
FAILED ../../../../beat/editor/test/test_assetwidget.py::TestAssetWidget::test_allow_load_invalid_json[AssetType.TOOLCHAIN]
FAILED ../../../../beat/editor/test/test_assetwidget.py::TestAssetWidget::test_change_on_disk[AssetType.TOOLCHAIN]
FAILED ../../../../beat/editor/test/test_assetwidget.py::TestAssetWidget::test_loading_v1_algorithm_refuse_update
FAILED ../../../../beat/editor/test/test_assetwidget.py::TestAssetWidget::test_loading_v1_algorithm_accept_update
=========== 111 failed, 1170 passed, 1 warnings in 147.58s (0:02:27) ===========
Tests failed for beat.editor-2.0.0b0-py36h1bb9003_14.conda - moving package to /scratch/builds/beat/beat.editor/miniconda/conda-bld/broken
WARNING:conda_build.build:Tests failed for beat.editor-2.0.0b0-py36h1bb9003_14.conda - moving package to /scratch/builds/beat/beat.editor/miniconda/conda-bld/broken
TESTS FAILED: beat.editor-2.0.0b0-py36h1bb9003_14.conda
ERROR: Job failed: exit code 1
failed
build_macosx_36 Build
FAILED ../../../../beat/editor/test/test_assetwidget.py::TestAssetWidget::test_allow_load_invalid_json[AssetType.TOOLCHAIN]
FAILED ../../../../beat/editor/test/test_assetwidget.py::TestAssetWidget::test_change_on_disk[AssetType.TOOLCHAIN]
FAILED ../../../../beat/editor/test/test_assetwidget.py::TestAssetWidget::test_loading_v1_algorithm_refuse_update
FAILED ../../../../beat/editor/test/test_assetwidget.py::TestAssetWidget::test_loading_v1_algorithm_accept_update
=========== 111 failed, 1170 passed, 1 warnings in 110.70s (0:01:50) ===========
Tests failed for beat.editor-2.0.0b0-py36h1bb9003_32.conda - moving package to /Users/gitlab/builds/b6d3167a/0/beat/beat.editor/miniconda/conda-bld/broken
WARNING:conda_build.build:Tests failed for beat.editor-2.0.0b0-py36h1bb9003_32.conda - moving package to /Users/gitlab/builds/b6d3167a/0/beat/beat.editor/miniconda/conda-bld/broken
TESTS FAILED: beat.editor-2.0.0b0-py36h1bb9003_32.conda
ERROR: Job failed: exit status 1
failed
build_macosx_37 Build
FAILED ../../../../beat/editor/test/test_assetwidget.py::TestAssetWidget::test_allow_load_invalid_json[AssetType.TOOLCHAIN]
FAILED ../../../../beat/editor/test/test_assetwidget.py::TestAssetWidget::test_change_on_disk[AssetType.TOOLCHAIN]
FAILED ../../../../beat/editor/test/test_assetwidget.py::TestAssetWidget::test_loading_v1_algorithm_refuse_update
FAILED ../../../../beat/editor/test/test_assetwidget.py::TestAssetWidget::test_loading_v1_algorithm_accept_update
=========== 111 failed, 1170 passed, 1 warnings in 110.65s (0:01:50) ===========
Tests failed for beat.editor-2.0.0b0-py37h1bb9003_29.conda - moving package to /Users/gitlab/builds/b6d3167a/1/beat/beat.editor/miniconda/conda-bld/broken
WARNING:conda_build.build:Tests failed for beat.editor-2.0.0b0-py37h1bb9003_29.conda - moving package to /Users/gitlab/builds/b6d3167a/1/beat/beat.editor/miniconda/conda-bld/broken
TESTS FAILED: beat.editor-2.0.0b0-py37h1bb9003_29.conda
ERROR: Job failed: exit status 1
failed
build_linux_37 Build
FAILED ../../../../beat/editor/test/test_assetwidget.py::TestAssetWidget::test_allow_load_invalid_json[AssetType.TOOLCHAIN]
FAILED ../../../../beat/editor/test/test_assetwidget.py::TestAssetWidget::test_change_on_disk[AssetType.TOOLCHAIN]
FAILED ../../../../beat/editor/test/test_assetwidget.py::TestAssetWidget::test_loading_v1_algorithm_refuse_update
FAILED ../../../../beat/editor/test/test_assetwidget.py::TestAssetWidget::test_loading_v1_algorithm_accept_update
=========== 111 failed, 1170 passed, 1 warnings in 142.31s (0:02:22) ===========
Tests failed for beat.editor-2.0.0b0-py37h1bb9003_14.conda - moving package to /scratch/builds/beat/beat.editor/miniconda/conda-bld/broken
WARNING:conda_build.build:Tests failed for beat.editor-2.0.0b0-py37h1bb9003_14.conda - moving package to /scratch/builds/beat/beat.editor/miniconda/conda-bld/broken
TESTS FAILED: beat.editor-2.0.0b0-py37h1bb9003_14.conda
ERROR: Job failed: exit code 1