Use a global prefix to keep things around, add an iris test

4 jobs for interactive in 3 minutes and 31 seconds (queued for 6 seconds)
latest
Status Job ID Name Coverage
  Build
failed #206507
docker-build
build_linux_36

00:01:51

failed #206508
docker-build
build_linux_37

00:01:47

failed #206505
macosx
build_macosx_36

00:03:30

failed #206506
macosx
build_macosx_37

00:03:24

 
Name Stage Failure
failed
build_macosx_36 Build
Tests failed for beat.core-1.10.7b0-py36he2776e4_12.conda - moving package to /Users/gitlab/builds/b6d3167a/0/beat/beat.core/miniconda/conda-bld/broken
WARNING:conda_build.build:Tests failed for beat.core-1.10.7b0-py36he2776e4_12.conda - moving package to /Users/gitlab/builds/b6d3167a/0/beat/beat.core/miniconda/conda-bld/broken
TESTS FAILED: beat.core-1.10.7b0-py36he2776e4_12.conda
Uploading artifacts for failed job
Uploading artifacts...
Runtime platform
arch=amd64 os=darwin pid=54752 revision=a998cacd version=13.2.2
WARNING: coverage.xml: no matching files
ERROR: No files to upload
ERROR: Job failed: exit status 1
failed
build_macosx_37 Build
Tests failed for beat.core-1.10.7b0-py37he2776e4_12.conda - moving package to /Users/gitlab/builds/b6d3167a/1/beat/beat.core/miniconda/conda-bld/broken
WARNING:conda_build.build:Tests failed for beat.core-1.10.7b0-py37he2776e4_12.conda - moving package to /Users/gitlab/builds/b6d3167a/1/beat/beat.core/miniconda/conda-bld/broken
TESTS FAILED: beat.core-1.10.7b0-py37he2776e4_12.conda
Uploading artifacts for failed job
Uploading artifacts...
Runtime platform
arch=amd64 os=darwin pid=54711 revision=a998cacd version=13.2.2
WARNING: coverage.xml: no matching files
ERROR: No files to upload
ERROR: Job failed: exit status 1
failed
build_linux_36 Build
Tests failed for beat.core-1.10.7b0-py36he2776e4_11.conda - moving package to /scratch/builds/iJyPBhV4/0/beat/beat.core/miniconda/conda-bld/broken
WARNING:conda_build.build:Tests failed for beat.core-1.10.7b0-py36he2776e4_11.conda - moving package to /scratch/builds/iJyPBhV4/0/beat/beat.core/miniconda/conda-bld/broken
TESTS FAILED: beat.core-1.10.7b0-py36he2776e4_11.conda
Uploading artifacts for failed job
Uploading artifacts...
Runtime platform
arch=amd64 os=linux pid=34359 revision=a998cacd version=13.2.2
WARNING: coverage.xml: no matching files
ERROR: No files to upload
ERROR: Job failed: exit status 1
failed
build_linux_37 Build
Tests failed for beat.core-1.10.7b0-py37he2776e4_12.conda - moving package to /scratch/builds/iJyPBhV4/1/beat/beat.core/miniconda/conda-bld/broken
WARNING:conda_build.build:Tests failed for beat.core-1.10.7b0-py37he2776e4_12.conda - moving package to /scratch/builds/iJyPBhV4/1/beat/beat.core/miniconda/conda-bld/broken
TESTS FAILED: beat.core-1.10.7b0-py37he2776e4_12.conda
Uploading artifacts for failed job
Uploading artifacts...
Runtime platform
arch=amd64 os=linux pid=34295 revision=a998cacd version=13.2.2
WARNING: coverage.xml: no matching files
ERROR: No files to upload
ERROR: Job failed: exit status 1