New interactive API

4 jobs for interactive in 2 minutes and 49 seconds (queued for 5 seconds)
Status Job ID Name Coverage
  Build
failed #205977
docker-build
build_linux_36

00:01:44

17.0%
failed #205978
docker-build
build_linux_37

00:01:44

17.0%
failed #205975
macosx
build_macosx_36

00:02:32

17.0%
failed #205976
macosx
build_macosx_37

00:02:49

17.0%
 
Name Stage Failure
failed
build_macosx_37 Build
Tests failed for beat.core-1.10.7b0-py37h883dc4e_8.conda - moving package to /Users/gitlab/builds/b6d3167a/1/beat/beat.core/miniconda/conda-bld/broken
WARNING:conda_build.build:Tests failed for beat.core-1.10.7b0-py37h883dc4e_8.conda - moving package to /Users/gitlab/builds/b6d3167a/1/beat/beat.core/miniconda/conda-bld/broken
TESTS FAILED: beat.core-1.10.7b0-py37h883dc4e_8.conda
Uploading artifacts for failed job
Uploading artifacts...
Runtime platform
arch=amd64 os=darwin pid=81442 revision=a998cacd version=13.2.2
WARNING: coverage.xml: no matching files
ERROR: No files to upload
ERROR: Job failed: exit status 1
failed
build_macosx_36 Build
Tests failed for beat.core-1.10.7b0-py36h883dc4e_8.conda - moving package to /Users/gitlab/builds/b6d3167a/0/beat/beat.core/miniconda/conda-bld/broken
WARNING:conda_build.build:Tests failed for beat.core-1.10.7b0-py36h883dc4e_8.conda - moving package to /Users/gitlab/builds/b6d3167a/0/beat/beat.core/miniconda/conda-bld/broken
TESTS FAILED: beat.core-1.10.7b0-py36h883dc4e_8.conda
Uploading artifacts for failed job
Uploading artifacts...
Runtime platform
arch=amd64 os=darwin pid=81202 revision=a998cacd version=13.2.2
WARNING: coverage.xml: no matching files
ERROR: No files to upload
ERROR: Job failed: exit status 1
failed
build_linux_37 Build
Tests failed for beat.core-1.10.7b0-py37h883dc4e_8.conda - moving package to /scratch/builds/iJyPBhV4/1/beat/beat.core/miniconda/conda-bld/broken
WARNING:conda_build.build:Tests failed for beat.core-1.10.7b0-py37h883dc4e_8.conda - moving package to /scratch/builds/iJyPBhV4/1/beat/beat.core/miniconda/conda-bld/broken
TESTS FAILED: beat.core-1.10.7b0-py37h883dc4e_8.conda
Uploading artifacts for failed job
Uploading artifacts...
Runtime platform
arch=amd64 os=linux pid=30141 revision=a998cacd version=13.2.2
WARNING: coverage.xml: no matching files
ERROR: No files to upload
ERROR: Job failed: exit status 1
failed
build_linux_36 Build
Tests failed for beat.core-1.10.7b0-py36h883dc4e_8.conda - moving package to /scratch/builds/iJyPBhV4/0/beat/beat.core/miniconda/conda-bld/broken
WARNING:conda_build.build:Tests failed for beat.core-1.10.7b0-py36h883dc4e_8.conda - moving package to /scratch/builds/iJyPBhV4/0/beat/beat.core/miniconda/conda-bld/broken
TESTS FAILED: beat.core-1.10.7b0-py36h883dc4e_8.conda
Uploading artifacts for failed job
Uploading artifacts...
Runtime platform
arch=amd64 os=linux pid=30107 revision=a998cacd version=13.2.2
WARNING: coverage.xml: no matching files
ERROR: No files to upload
ERROR: Job failed: exit status 1