[test][execution] Ensure that writing to a non existing output shows an error

8 jobs for 99_ensure_output_error_is_reported in 16 minutes and 53 seconds (queued for 6 seconds)
Status Job ID Name Coverage
  Build
failed #201789
docker-build
build_linux_36

00:14:18

64.0%
failed #201790
docker-build
build_linux_37

00:14:13

64.0%
failed #201787
macosx
build_macosx_36

00:16:53

64.0%
failed #201788
macosx
build_macosx_37

00:16:40

63.0%
failed #201760
docker-build
build_linux_36

00:14:10

64.0%
failed #201761
docker-build
build_linux_37

00:14:10

64.0%
failed #201758
macosx
build_macosx_36

00:16:27

64.0%
failed #201759
macosx
build_macosx_37

00:16:12

64.0%
 
Name Stage Failure
failed
build_macosx_36 Build
WARNING:conda_build.build:Tests failed for beat.core-1.10.5b0-py36h883dc4e_16.conda - moving package to /Users/gitlab/builds/b6d3167a/0/beat/beat.core/miniconda/conda-bld/broken
TESTS FAILED: beat.core-1.10.5b0-py36h883dc4e_16.conda
Running after_script
Uploading artifacts for failed job
Uploading artifacts...
Runtime platform
arch=amd64 os=darwin pid=71481 revision=21cb397c version=13.0.1
WARNING: coverage.xml: no matching files
ERROR: No files to upload
ERROR: Job failed: exit status 1
failed
build_macosx_37 Build
WARNING:conda_build.build:Tests failed for beat.core-1.10.5b0-py37h883dc4e_17.conda - moving package to /Users/gitlab/builds/b6d3167a/1/beat/beat.core/miniconda/conda-bld/broken
TESTS FAILED: beat.core-1.10.5b0-py37h883dc4e_17.conda
Running after_script
Uploading artifacts for failed job
Uploading artifacts...
Runtime platform
arch=amd64 os=darwin pid=71446 revision=21cb397c version=13.0.1
WARNING: coverage.xml: no matching files
ERROR: No files to upload
ERROR: Job failed: exit status 1
failed
build_linux_36 Build
WARNING:conda_build.build:Tests failed for beat.core-1.10.5b0-py36h883dc4e_18.conda - moving package to /scratch/builds/iJyPBhV4/0/beat/beat.core/miniconda/conda-bld/broken
TESTS FAILED: beat.core-1.10.5b0-py36h883dc4e_18.conda
Running after_script
Uploading artifacts for failed job
Uploading artifacts...
Runtime platform
arch=amd64 os=linux pid=1473 revision=21cb397c version=13.0.1
WARNING: coverage.xml: no matching files
ERROR: No files to upload
ERROR: Job failed: exit status 1
failed
build_linux_37 Build
WARNING:conda_build.build:Tests failed for beat.core-1.10.5b0-py37h883dc4e_18.conda - moving package to /scratch/builds/iJyPBhV4/1/beat/beat.core/miniconda/conda-bld/broken
TESTS FAILED: beat.core-1.10.5b0-py37h883dc4e_18.conda
Running after_script
Uploading artifacts for failed job
Uploading artifacts...
Runtime platform
arch=amd64 os=linux pid=1400 revision=21cb397c version=13.0.1
WARNING: coverage.xml: no matching files
ERROR: No files to upload
ERROR: Job failed: exit status 1