[test][lib] Add duplicate key test

4 jobs for <span class="ref-name">82_duplicate_key_handling</span> in 14 minutes and 53 seconds (queued for 3 seconds)
Status Job ID Name Coverage
  Build
failed #167033
docker-build
build_linux_36

00:14:00

64.0%
failed #167034
macosx
build_macosx_36

00:14:53

64.0%
failed #166981
docker-build
build_linux_36

00:03:54

failed #166982
macosx
build_macosx_36

00:06:57

 
Name Stage Failure
failed
build_linux_36 Build
TOTAL                                3708   1334    64%
----------------------------------------------------------------------
Ran 304 tests in 607.041s

FAILED (SKIP=3, failures=1)
Tests failed for beat.core-1.8.1b0-py36h3fd4c5d_82.tar.bz2 - moving package to /scratch/builds/iJyPBhV4/0/beat/beat.core/miniconda/conda-bld/broken
WARNING:conda_build.build:Tests failed for beat.core-1.8.1b0-py36h3fd4c5d_82.tar.bz2 - moving package to /scratch/builds/iJyPBhV4/0/beat/beat.core/miniconda/conda-bld/broken
TESTS FAILED: beat.core-1.8.1b0-py36h3fd4c5d_82.tar.bz2
ERROR: Job failed: exit status 1
failed
build_macosx_36 Build
TOTAL                                3708   1334    64%
----------------------------------------------------------------------
Ran 304 tests in 697.658s

FAILED (SKIP=3, failures=1)
Tests failed for beat.core-1.8.1b0-py36h3fd4c5d_88.tar.bz2 - moving package to /Users/gitlab/builds/b6d3167a/0/beat/beat.core/miniconda/conda-bld/broken
WARNING:conda_build.build:Tests failed for beat.core-1.8.1b0-py36h3fd4c5d_88.tar.bz2 - moving package to /Users/gitlab/builds/b6d3167a/0/beat/beat.core/miniconda/conda-bld/broken
TESTS FAILED: beat.core-1.8.1b0-py36h3fd4c5d_88.tar.bz2
ERROR: Job failed: exit status 1