fix ci test line

2 jobs for test-74-parameter-schemas in 5 minutes and 14 seconds (queued for 3 seconds)
Status Job ID Name Coverage
  Build
failed #164406
docker-build
build_linux_36

00:03:47

30.0%
failed #164407
macosx
build_macosx_36

00:05:14

30.0%
 
Name Stage Failure
failed
build_macosx_36 Build
TOTAL                                451    317    30%
----------------------------------------------------------------------
Ran 15 tests in 0.744s

FAILED (errors=15)
Tests failed for beat.core-1.8.1b0-py36h7894927_48.tar.bz2 - moving package to /Users/gitlab/builds/f6f95b82/0/beat/beat.core/miniconda/conda-bld/broken
WARNING:conda_build.build:Tests failed for beat.core-1.8.1b0-py36h7894927_48.tar.bz2 - moving package to /Users/gitlab/builds/f6f95b82/0/beat/beat.core/miniconda/conda-bld/broken
TESTS FAILED: beat.core-1.8.1b0-py36h7894927_48.tar.bz2
ERROR: Job failed: exit status 1
failed
build_linux_36 Build
TOTAL                                451    317    30%
----------------------------------------------------------------------
Ran 15 tests in 0.220s

FAILED (errors=15)
Tests failed for beat.core-1.8.1b0-py36h7894927_45.tar.bz2 - moving package to /scratch/builds/iJyPBhV4/4/beat/beat.core/miniconda/conda-bld/broken
WARNING:conda_build.build:Tests failed for beat.core-1.8.1b0-py36h7894927_45.tar.bz2 - moving package to /scratch/builds/iJyPBhV4/4/beat/beat.core/miniconda/conda-bld/broken
TESTS FAILED: beat.core-1.8.1b0-py36h7894927_45.tar.bz2
ERROR: Job failed: exit status 1