Use a global prefix to keep things around, add an iris test

4 jobs for interactive in 90 minutes and 5 seconds (queued for 2 seconds)
latest
Status Job ID Name Coverage
  Build
failed #206503
docker
build_linux_36

01:30:00

32.0%
failed #206504
docker
build_linux_37

01:30:00

32.0%
failed #206501
macosx
build_macosx_36

01:30:00

32.0%
failed #206502
macosx
build_macosx_37

01:30:00

32.0%
 
Name Stage Failure
failed
build_linux_37 Build The script exceeded the maximum execution time set for the job
-----------------------------------------------------------------------
TOTAL 3794 2597 32%
----------------------------------------------------------------------
Ran 346 tests in 1.383s

FAILED (errors=272, failures=7)
Uploading artifacts for failed job
Pulling docker image gitlab/gitlab-runner-helper:x86_64-a998cacd ...
ERROR: Job failed: execution took longer than 1h30m0s seconds
failed
build_linux_36 Build The script exceeded the maximum execution time set for the job
-----------------------------------------------------------------------
TOTAL 3794 2597 32%
----------------------------------------------------------------------
Ran 346 tests in 1.227s

FAILED (errors=272, failures=7)
Uploading artifacts for failed job
Pulling docker image gitlab/gitlab-runner-helper:x86_64-a998cacd ...
ERROR: Job failed: execution took longer than 1h30m0s seconds
failed
build_macosx_37 Build The script exceeded the maximum execution time set for the job
beat/backend/python/utils.py                          173    107    38%
-----------------------------------------------------------------------
TOTAL 3794 2596 32%
----------------------------------------------------------------------
Ran 346 tests in 1.652s

FAILED (errors=272, failures=7)
Uploading artifacts for failed job
ERROR: Job failed: execution took longer than 1h30m0s seconds
failed
build_macosx_36 Build The script exceeded the maximum execution time set for the job
beat/backend/python/utils.py                          173    107    38%
-----------------------------------------------------------------------
TOTAL 3794 2596 32%
----------------------------------------------------------------------
Ran 346 tests in 1.944s

FAILED (errors=272, failures=7)
Uploading artifacts for failed job
ERROR: Job failed: execution took longer than 1h30m0s seconds