Integrate deeper with config and prefix

4 jobs for interactive in 90 minutes and 3 seconds (queued for 2 seconds)
Status Job ID Name Coverage
  Build
failed #205973
docker
build_linux_36

01:30:00

29.0%
failed #205974
docker
build_linux_37

01:30:00

29.0%
failed #205971
macosx
build_macosx_36

01:30:00

29.0%
failed #205972
macosx
build_macosx_37

01:30:00

29.0%
 
Name Stage Failure
failed
build_linux_37 Build The script exceeded the maximum execution time set for the job
-----------------------------------------------------------------------
TOTAL 3661 2606 29%
----------------------------------------------------------------------
Ran 346 tests in 1.366s

FAILED (errors=299, failures=6)
Uploading artifacts for failed job
Pulling docker image gitlab/gitlab-runner-helper:x86_64-a998cacd ...
ERROR: Job failed: execution took longer than 1h30m0s seconds
failed
build_linux_36 Build The script exceeded the maximum execution time set for the job
-----------------------------------------------------------------------
TOTAL 3661 2606 29%
----------------------------------------------------------------------
Ran 346 tests in 1.319s

FAILED (errors=299, failures=6)
Uploading artifacts for failed job
Pulling docker image gitlab/gitlab-runner-helper:x86_64-a998cacd ...
ERROR: Job failed: execution took longer than 1h30m0s seconds
failed
build_macosx_37 Build The script exceeded the maximum execution time set for the job
beat/backend/python/utils.py                          167     84    50%
-----------------------------------------------------------------------
TOTAL 3661 2605 29%
----------------------------------------------------------------------
Ran 346 tests in 1.600s

FAILED (errors=299, failures=6)
Uploading artifacts for failed job
ERROR: Job failed: execution took longer than 1h30m0s seconds
failed
build_macosx_36 Build The script exceeded the maximum execution time set for the job
beat/backend/python/utils.py                          167     84    50%
-----------------------------------------------------------------------
TOTAL 3661 2605 29%
----------------------------------------------------------------------
Ran 346 tests in 1.834s

FAILED (errors=299, failures=6)
Uploading artifacts for failed job
ERROR: Job failed: execution took longer than 1h30m0s seconds