[prefix] remove prefix requirement till experiments

4 jobs for interactive in 2 minutes and 50 seconds (queued for 6 seconds)
Status Job ID Name Coverage
  Build
failed #203279
docker
build_linux_36

00:02:47

63.0%
failed #203280
docker
build_linux_37

00:02:43

63.0%
failed #203277
macosx
build_macosx_36

00:02:30

63.0%
failed #203278
macosx
build_macosx_37

00:02:26

63.0%
 
Name Stage Failure
failed
build_linux_36 Build
FAILED (errors=67)
Tests failed for beat.backend.python-1.7.11b0-py36h31b87b5_14.conda - moving package to /scratch/builds/beat/beat.backend.python/miniconda/conda-bld/broken
WARNING:conda_build.build:Tests failed for beat.backend.python-1.7.11b0-py36h31b87b5_14.conda - moving package to /scratch/builds/beat/beat.backend.python/miniconda/conda-bld/broken
TESTS FAILED: beat.backend.python-1.7.11b0-py36h31b87b5_14.conda
Uploading artifacts for failed job
Uploading artifacts...
WARNING: coverage.xml: no matching files
ERROR: No files to upload
ERROR: Job failed: exit code 1
failed
build_linux_37 Build
FAILED (errors=67)
Tests failed for beat.backend.python-1.7.11b0-py37h31b87b5_14.conda - moving package to /scratch/builds/beat/beat.backend.python/miniconda/conda-bld/broken
WARNING:conda_build.build:Tests failed for beat.backend.python-1.7.11b0-py37h31b87b5_14.conda - moving package to /scratch/builds/beat/beat.backend.python/miniconda/conda-bld/broken
TESTS FAILED: beat.backend.python-1.7.11b0-py37h31b87b5_14.conda
Uploading artifacts for failed job
Uploading artifacts...
WARNING: coverage.xml: no matching files
ERROR: No files to upload
ERROR: Job failed: exit code 1
failed
build_macosx_36 Build
Tests failed for beat.backend.python-1.7.11b0-py36h31b87b5_14.conda - moving package to /Users/gitlab/builds/b6d3167a/0/beat/beat.backend.python/miniconda/conda-bld/broken
WARNING:conda_build.build:Tests failed for beat.backend.python-1.7.11b0-py36h31b87b5_14.conda - moving package to /Users/gitlab/builds/b6d3167a/0/beat/beat.backend.python/miniconda/conda-bld/broken
TESTS FAILED: beat.backend.python-1.7.11b0-py36h31b87b5_14.conda
Uploading artifacts for failed job
Uploading artifacts...
Runtime platform
arch=amd64 os=darwin pid=29563 revision=6fbc7474 version=13.1.1
WARNING: coverage.xml: no matching files
ERROR: No files to upload
ERROR: Job failed: exit status 1
failed
build_macosx_37 Build
Tests failed for beat.backend.python-1.7.11b0-py37h31b87b5_14.conda - moving package to /Users/gitlab/builds/b6d3167a/1/beat/beat.backend.python/miniconda/conda-bld/broken
WARNING:conda_build.build:Tests failed for beat.backend.python-1.7.11b0-py37h31b87b5_14.conda - moving package to /Users/gitlab/builds/b6d3167a/1/beat/beat.backend.python/miniconda/conda-bld/broken
TESTS FAILED: beat.backend.python-1.7.11b0-py37h31b87b5_14.conda
Uploading artifacts for failed job
Uploading artifacts...
Runtime platform
arch=amd64 os=darwin pid=29551 revision=6fbc7474 version=13.1.1
WARNING: coverage.xml: no matching files
ERROR: No files to upload
ERROR: Job failed: exit status 1